Information card for entry 4516663
Formula | C44.5 H38 Cl F6 N5 O6 P Ru S2 |
Calculated formula | C44.5 H38 Cl F6 N5 O6 P Ru S2 |
Title of publication | Mechanism of N,N,N-Amide Ruthenium(II) Hydride Mediated Acceptorless Alcohol Dehydrogenation: Inner-Sphere β-H Elimination versus Outer-Sphere Bifunctional Metal‒Ligand Cooperativity |
Authors of publication | Tseng, Kuei-Nin T.; Kampf, Jeff W.; Szymczak, Nathaniel K. |
Journal of publication | ACS Catalysis |
Year of publication | 2015 |
Journal volume | 5 |
Journal issue | 9 |
Pages of publication | 5468 |
a | 31.847 ± 0.002 Å |
b | 12.7757 ± 0.0002 Å |
c | 25.6211 ± 0.0005 Å |
α | 90° |
β | 117.055 ± 0.008° |
γ | 90° |
Cell volume | 9283.7 ± 0.9 Å3 |
Cell temperature | 85 ± 2 K |
Ambient diffraction temperature | 85 ± 2 K |
Number of distinct elements | 9 |
Space group number | 15 |
Hermann-Mauguin space group symbol | C 1 2/c 1 |
Hall space group symbol | -C 2yc |
Residual factor for all reflections | 0.0518 |
Residual factor for significantly intense reflections | 0.0487 |
Weighted residual factors for significantly intense reflections | 0.1415 |
Weighted residual factors for all reflections included in the refinement | 0.1436 |
Goodness-of-fit parameter for all reflections included in the refinement | 1.101 |
Diffraction radiation wavelength | 1.54178 Å |
Diffraction radiation type | CuKα |