Information card for entry 4516665
Formula | C54 H42 Cl N5 P2 Ru |
Calculated formula | C54 H42 Cl N5 P2 Ru |
SMILES | [Ru]12(Cl)([P](c3ccccc3)(c3ccccc3)c3ccccc3)([P](c3ccccc3)(c3ccccc3)c3ccccc3)[n]3ccccc3N=C3N1C(=Nc1[n]2cccc1)c1c3cccc1 |
Title of publication | Mechanism of N,N,N-Amide Ruthenium(II) Hydride Mediated Acceptorless Alcohol Dehydrogenation: Inner-Sphere β-H Elimination versus Outer-Sphere Bifunctional Metal‒Ligand Cooperativity |
Authors of publication | Tseng, Kuei-Nin T.; Kampf, Jeff W.; Szymczak, Nathaniel K. |
Journal of publication | ACS Catalysis |
Year of publication | 2015 |
Journal volume | 5 |
Journal issue | 9 |
Pages of publication | 5468 |
a | 11.5459 ± 0.0002 Å |
b | 20.4778 ± 0.0004 Å |
c | 18.8418 ± 0.0013 Å |
α | 90° |
β | 104.485 ± 0.007° |
γ | 90° |
Cell volume | 4313.2 ± 0.3 Å3 |
Cell temperature | 85 ± 2 K |
Ambient diffraction temperature | 85 ± 2 K |
Number of distinct elements | 6 |
Space group number | 14 |
Hermann-Mauguin space group symbol | P 1 21/c 1 |
Hall space group symbol | -P 2ybc |
Residual factor for all reflections | 0.0225 |
Residual factor for significantly intense reflections | 0.0223 |
Weighted residual factors for significantly intense reflections | 0.0551 |
Weighted residual factors for all reflections included in the refinement | 0.0552 |
Goodness-of-fit parameter for all reflections included in the refinement | 1.039 |
Diffraction radiation wavelength | 1.54178 Å |
Diffraction radiation type | CuKα |