Information card for entry 4516667
Formula | C60 H54 Cl N5 O3.5 P2 Ru |
Calculated formula | C60 H54 Cl N5 O3.5 P2 Ru |
Title of publication | Mechanism of N,N,N-Amide Ruthenium(II) Hydride Mediated Acceptorless Alcohol Dehydrogenation: Inner-Sphere β-H Elimination versus Outer-Sphere Bifunctional Metal‒Ligand Cooperativity |
Authors of publication | Tseng, Kuei-Nin T.; Kampf, Jeff W.; Szymczak, Nathaniel K. |
Journal of publication | ACS Catalysis |
Year of publication | 2015 |
Journal volume | 5 |
Journal issue | 9 |
Pages of publication | 5468 |
a | 23.8181 ± 0.0017 Å |
b | 11.25 ± 0.0002 Å |
c | 20.994 ± 0.002 Å |
α | 90° |
β | 115.986 ± 0.009° |
γ | 90° |
Cell volume | 5056.7 ± 0.7 Å3 |
Cell temperature | 85 ± 2 K |
Ambient diffraction temperature | 85 ± 2 K |
Number of distinct elements | 7 |
Space group number | 14 |
Hermann-Mauguin space group symbol | P 1 21/c 1 |
Hall space group symbol | -P 2ybc |
Residual factor for all reflections | 0.0763 |
Residual factor for significantly intense reflections | 0.0706 |
Weighted residual factors for significantly intense reflections | 0.1914 |
Weighted residual factors for all reflections included in the refinement | 0.1993 |
Goodness-of-fit parameter for all reflections included in the refinement | 1.11 |
Diffraction radiation wavelength | 1.54178 Å |
Diffraction radiation type | CuKα |