Information card for entry 4516670
Formula | C38 H32 Cl F6 N5 P2 Ru |
Calculated formula | C38 H32 Cl F6 N5 P2 Ru |
Title of publication | Mechanism of N,N,N-Amide Ruthenium(II) Hydride Mediated Acceptorless Alcohol Dehydrogenation: Inner-Sphere β-H Elimination versus Outer-Sphere Bifunctional Metal‒Ligand Cooperativity |
Authors of publication | Tseng, Kuei-Nin T.; Kampf, Jeff W.; Szymczak, Nathaniel K. |
Journal of publication | ACS Catalysis |
Year of publication | 2015 |
Journal volume | 5 |
Journal issue | 9 |
Pages of publication | 5468 |
a | 9.0716 ± 0.0009 Å |
b | 12.721 ± 0.0007 Å |
c | 15.6504 ± 0.0017 Å |
α | 93.195 ± 0.006° |
β | 103.235 ± 0.009° |
γ | 93.102 ± 0.002° |
Cell volume | 1751.2 ± 0.3 Å3 |
Cell temperature | 85 ± 2 K |
Ambient diffraction temperature | 85 ± 2 K |
Number of distinct elements | 7 |
Space group number | 2 |
Hermann-Mauguin space group symbol | P -1 |
Hall space group symbol | -P 1 |
Residual factor for all reflections | 0.0231 |
Residual factor for significantly intense reflections | 0.023 |
Weighted residual factors for significantly intense reflections | 0.0592 |
Weighted residual factors for all reflections included in the refinement | 0.0593 |
Goodness-of-fit parameter for all reflections included in the refinement | 1.056 |
Diffraction radiation wavelength | 1.54178 Å |
Diffraction radiation type | CuKα |