Information card for entry 4516690
Formula | C24 H32 F3 I O3 S |
Calculated formula | C24 H32 F3 I O3 S |
SMILES | [I+](c1cc(c(cc1)C)C)c1c(C(C)C)cc(C(C)C)cc1C(C)C.S(=O)(=O)([O-])C(F)(F)F |
Title of publication | Copper-Catalyzed para-Selective C‒H Amination of Electron-Rich Arenes |
Authors of publication | Berzina, Beatrise; Sokolovs, Igors; Suna, Edgars |
Journal of publication | ACS Catalysis |
Year of publication | 2015 |
Journal volume | 5 |
Journal issue | 11 |
Pages of publication | 7008 |
a | 9.6451 ± 0.0002 Å |
b | 25.6279 ± 0.0005 Å |
c | 10.7472 ± 0.0002 Å |
α | 90° |
β | 102.565 ± 0.001° |
γ | 90° |
Cell volume | 2592.91 ± 0.09 Å3 |
Cell temperature | 163 ± 2 K |
Ambient diffraction temperature | 163 ± 2 K |
Number of distinct elements | 6 |
Space group number | 14 |
Hermann-Mauguin space group symbol | P 1 21/c 1 |
Hall space group symbol | -P 2ybc |
Residual factor for all reflections | 0.0798 |
Residual factor for significantly intense reflections | 0.0594 |
Weighted residual factors for significantly intense reflections | 0.1303 |
Weighted residual factors for all reflections included in the refinement | 0.1377 |
Goodness-of-fit parameter for all reflections included in the refinement | 1.126 |
Diffraction radiation wavelength | 0.71073 Å |
Diffraction radiation type | MoKα |