Information card for entry 4516811
Formula | C50 H61 F Ni O P2 |
Calculated formula | C50 H61 F Ni O P2 |
SMILES | [Ni]1([P]([C@@H]2C[C@@H](CC[C@H]2C(C)C)C)(c2c(O1)cccc2)[C@@H]1C[C@@H](CC[C@H]1C(C)C)C)([P](c1ccccc1)(c1ccccc1)c1ccccc1)c1ccc(F)cc1 |
Title of publication | Nickel-Catalyzed Propylene/Polar Monomer Copolymerization |
Authors of publication | Konishi, Yohei; Tao, Wen-jie; Yasuda, Hina; Ito, Shingo; Oishi, Yasuo; Ohtaki, Hisashi; Tanna, Akio; Tayano, Takao; Nozaki, Kyoko |
Journal of publication | ACS Macro Letters |
Year of publication | 2018 |
Journal volume | 7 |
Journal issue | 2 |
Pages of publication | 213 |
a | 10.862 ± 0.003 Å |
b | 17.927 ± 0.004 Å |
c | 12.12 ± 0.003 Å |
α | 90° |
β | 111.13 ± 0.003° |
γ | 90° |
Cell volume | 2201.4 ± 1 Å3 |
Cell temperature | 93 K |
Ambient diffraction temperature | 93 K |
Number of distinct elements | 6 |
Space group number | 4 |
Hermann-Mauguin space group symbol | P 1 21 1 |
Hall space group symbol | P 2yb |
Residual factor for all reflections | 0.0318 |
Residual factor for significantly intense reflections | 0.0306 |
Weighted residual factors for significantly intense reflections | 0.0756 |
Weighted residual factors for all reflections included in the refinement | 0.0767 |
Goodness-of-fit parameter for all reflections included in the refinement | 1.04 |
Diffraction radiation wavelength | 0.71075 Å |
Diffraction radiation type | MoKα |