Information card for entry 4517494
Formula | C58 H53 N4 O28 Y3 |
Calculated formula | C58 H53 N4 O28 Y3 |
Title of publication | Rational Construction of Porous Metal-Organic Frameworks for Uranium(VI) Extraction: The Strong Periodic Tendency with a Metal Node. |
Authors of publication | Zhang, Zhi-Hui; Lan, Jian-Hui; Yuan, Li-Yong; Sheng, Pan-Pan; He, Ming-Yang; Zheng, Li-Rong; Chen, Qun; Chai, Zhi-Fang; Gibson, John K.; Shi, Wei-Qun |
Journal of publication | ACS applied materials & interfaces |
Year of publication | 2020 |
a | 11.5652 ± 0.0008 Å |
b | 12.1973 ± 0.0009 Å |
c | 13.4782 ± 0.0011 Å |
α | 65.045 ± 0.003° |
β | 67.26 ± 0.003° |
γ | 87.751 ± 0.004° |
Cell volume | 1572.3 ± 0.2 Å3 |
Cell temperature | 296 ± 2 K |
Ambient diffraction temperature | 296 ± 2 K |
Number of distinct elements | 5 |
Space group number | 2 |
Hermann-Mauguin space group symbol | P -1 |
Hall space group symbol | -P 1 |
Residual factor for all reflections | 0.0959 |
Residual factor for significantly intense reflections | 0.0651 |
Weighted residual factors for significantly intense reflections | 0.1555 |
Weighted residual factors for all reflections included in the refinement | 0.1706 |
Goodness-of-fit parameter for all reflections included in the refinement | 1.064 |
Diffraction radiation wavelength | 0.71073 Å |
Diffraction radiation type | MoKα |