Information card for entry 4517500
Formula | C26 H18 Ag F6 N4 Sb |
Calculated formula | C26 H18 Ag F6 N4 Sb |
Title of publication | A Highly Efficient Coordination Polymer for Selective Trapping and Sensing of Perrhenate/Pertechnetate. |
Authors of publication | Li, Cheng-Peng; Zhou, Hang; Chen, Jing; Wang, Jia-Jun; Du, Miao; Zhou, Wuzong |
Journal of publication | ACS applied materials & interfaces |
Year of publication | 2020 |
Journal volume | 12 |
Journal issue | 13 |
Pages of publication | 15246 - 15254 |
a | 14.1795 ± 0.0003 Å |
b | 8.7989 ± 0.0002 Å |
c | 20.5217 ± 0.0004 Å |
α | 90° |
β | 102.312 ± 0.002° |
γ | 90° |
Cell volume | 2501.48 ± 0.09 Å3 |
Cell temperature | 293 ± 2 K |
Ambient diffraction temperature | 293 ± 2 K |
Number of distinct elements | 6 |
Space group number | 14 |
Hermann-Mauguin space group symbol | P 1 21/n 1 |
Hall space group symbol | -P 2yn |
Residual factor for all reflections | 0.0483 |
Residual factor for significantly intense reflections | 0.0436 |
Weighted residual factors for significantly intense reflections | 0.1191 |
Weighted residual factors for all reflections included in the refinement | 0.1235 |
Goodness-of-fit parameter for all reflections included in the refinement | 1.06 |
Diffraction radiation wavelength | 1.54184 Å |
Diffraction radiation type | CuKα |