Information card for entry 4518142
Formula |
C41 H23 Cl6.75 N2 O4 |
Calculated formula |
C40.886 H22.886 Cl6.658 N2 O4 |
Title of publication |
Surface-Doped Quasi-2D Chiral Organic Single Crystals for Chiroptical Sensing |
Authors of publication |
Shang, Xiaobo; Song, Inho; Lee, Jeong Hyeon; Choi, Wanuk; Ahn, Jaeyong; Ohtsu, Hiroyoshi; Kim, Jin Chul; Koo, Jin Young; Kwak, Sang Kyu; Oh, Joon Hak |
Journal of publication |
ACS Nano |
Year of publication |
2020 |
a |
11.706 ± 0.006 Å |
b |
30.339 ± 0.015 Å |
c |
12.025 ± 0.006 Å |
α |
90° |
β |
118.785 ± 0.014° |
γ |
90° |
Cell volume |
3743 ± 3 Å3 |
Cell temperature |
100 ± 2 K |
Ambient diffraction temperature |
100 ± 2 K |
Number of distinct elements |
5 |
Space group number |
4 |
Hermann-Mauguin space group symbol |
P 1 21 1 |
Hall space group symbol |
P 2yb |
Residual factor for all reflections |
0.118 |
Residual factor for significantly intense reflections |
0.0685 |
Weighted residual factors for significantly intense reflections |
0.1735 |
Weighted residual factors for all reflections included in the refinement |
0.2029 |
Goodness-of-fit parameter for all reflections included in the refinement |
1.014 |
Diffraction radiation wavelength |
0.71073 Å |
Diffraction radiation type |
MoKα |
Yes |
No |
No |