Information card for entry 4518609
Formula | C5 H11 I4 N3 Pb |
Calculated formula | C5 H11 I4 N3 Pb |
Title of publication | Formation of Corrugated n = 1 2D Tin Iodide Perovskites and Their Use as Lead-Free Solar Absorbers |
Authors of publication | Febriansyah, Benny; Lekina, Yulia; Kaur, Jagjit; Hooper, Thomas J. N.; Harikesh, Padinhare Cholakkal; Salim, Teddy; Lim, Ming Hui; Koh, Teck Ming; Chakraborty, Sudip; Shen, Ze Xiang; Mathews, Nripan; England, Jason |
Journal of publication | ACS Nano |
Year of publication | 2021 |
a | 10.672 ± 0.002 Å |
b | 12.356 ± 0.002 Å |
c | 12.71 ± 0.003 Å |
α | 90° |
β | 110.951 ± 0.01° |
γ | 90° |
Cell volume | 1565.2 ± 0.5 Å3 |
Cell temperature | 100 ± 2 K |
Ambient diffraction temperature | 100 ± 2 K |
Number of distinct elements | 5 |
Space group number | 14 |
Hermann-Mauguin space group symbol | P 1 21/c 1 |
Hall space group symbol | -P 2ybc |
Residual factor for all reflections | 0.1194 |
Residual factor for significantly intense reflections | 0.0759 |
Weighted residual factors for significantly intense reflections | 0.1373 |
Weighted residual factors for all reflections included in the refinement | 0.1565 |
Goodness-of-fit parameter for all reflections included in the refinement | 1.033 |
Diffraction radiation wavelength | 0.71073 Å |
Diffraction radiation type | MoKα |