Information card for entry 4518680
Formula | C21 H20 Cl N |
Calculated formula | C21 H20 Cl N |
Title of publication | Pyrimidopteridine-Catalyzed Hydroamination of Stilbenes with Primary Amines: A Dual Photoredox and Hydrogen Atom Transfer Catalyst |
Authors of publication | Taeufer, Tobias; Hauptmann, Richy; El-Hage, Firas; Mayer, Thea S.; Jiao, Haijun; Rabeah, Jabor; Pospech, Jola |
Journal of publication | ACS Catalysis |
Year of publication | 2021 |
Journal volume | 11 |
Journal issue | 8 |
Pages of publication | 4862 - 4869 |
a | 19.1956 ± 0.0005 Å |
b | 5.6975 ± 0.0002 Å |
c | 16.7242 ± 0.0004 Å |
α | 90° |
β | 114.44 ± 0.0011° |
γ | 90° |
Cell volume | 1665.19 ± 0.08 Å3 |
Cell temperature | 150 ± 2 K |
Ambient diffraction temperature | 150 ± 2 K |
Number of distinct elements | 4 |
Space group number | 14 |
Hermann-Mauguin space group symbol | P 1 21/c 1 |
Hall space group symbol | -P 2ybc |
Residual factor for all reflections | 0.0396 |
Residual factor for significantly intense reflections | 0.035 |
Weighted residual factors for significantly intense reflections | 0.0875 |
Weighted residual factors for all reflections included in the refinement | 0.091 |
Goodness-of-fit parameter for all reflections included in the refinement | 1.051 |
Diffraction radiation wavelength | 1.54178 Å |
Diffraction radiation type | CuKα |