Information card for entry 5000043
Chemical name |
Dicopper dihydroxide carbonate |
Mineral name |
Malachite |
Formula |
C H2 Cu2 O5 |
Calculated formula |
C H2 Cu2 O5 |
Title of publication |
Verfeinerung der Struktur von Malachit, Cu2 (O H)2 C O3, durch Neutronenbeugung |
Authors of publication |
Zigan, F; Joswig, W; Schuster, H U; Mason, S A |
Journal of publication |
Zeitschrift fuer Kristallographie, Kristallgeometrie, Kristallphysik, Kristallchemie (145,1977-148,1979) |
Year of publication |
1977 |
Journal volume |
145 |
Pages of publication |
412 - 426 |
a |
9.502 Å |
b |
11.974 Å |
c |
3.24 Å |
α |
90° |
β |
98.75° |
γ |
90° |
Cell volume |
364.3 Å3 |
Number of distinct elements |
4 |
Space group number |
14 |
Hermann-Mauguin space group symbol |
P 1 21/a 1 |
Hall space group symbol |
-P 2yab |
Yes |
No |
No |