Information card for entry 6000220
HTML
Structure parameters
Formula
C49 H42 Fe N2 O4 P2 Ru
Title of publication
Structure of 1,1,2,2-tetracarbonyl(N-[(2-pyridyl)methylidene]isopropylamine-mu-N1,2-sigma-N2,1-eta-2-CH=N1)-1,2-bis(triphenylphosphine)ironruthenium(Fe-Ru)
Authors of publication
Numan, M.; Goubitz, K.; Schenk, H.; Kraakman, M. J. A.
Journal of publication
Acta Crystallographica C
Year of publication
1992
Journal volume
48
Journal issue
3
Pages of publication
549 - 551
a
11.625 Å
b
14.269 Å
c
15.963 Å
α
90.95°
β
100.23°
γ
101.95°
Cell volume
2545.42 Å
3
Number of distinct elements
7
Hermann-Mauguin space group symbol
P -1
Duplicate of
No
No
obs
No