Information card for entry 6000394
HTML
Structure parameters
Formula
B2 Ir5 Sc3
Title of publication
Scandium iridium boride Sc3Ir5B2 and the quaternary derivatives Sc2MIr5B2 with m = Be, Al, Si, Ti, V, Cr, Mn, Fe, Co, Ni, Cu, Ga, or Ge: Preparation, crystal structure, and physical properties
Authors of publication
Nagelschmitz, E. A.; Jung, W.
Journal of publication
Chemistry of Materials
Year of publication
1998
Journal volume
10
Pages of publication
3189 - 3195
a
9.526 Å
b
9.526 Å
c
3.048 Å
α
90°
β
90°
γ
90°
Cell volume
276.59 Å
3
Number of distinct elements
3
Hermann-Mauguin space group symbol
P 4/m b m
No
No
obs
No