Information card for entry 6000708
Formula | Ce H12 Mg N6 O24 |
Calculated formula | Ce Mg N6 O24 |
Title of publication | Structures and thermal-behavior of Ce(IV) magnesium-nitrate hydrates |
Authors of publication | Guillou, N.; Louer, M.; Auffredic, J.-P.; Louer, D. |
Journal of publication | European Journal of Solid State and Inorganic Chemistry |
Year of publication | 1995 |
Journal volume | 32 |
Pages of publication | 35 - 47 |
a | 12.5702 ± 0.0007 Å |
b | 12.5702 ± 0.0007 Å |
c | 12.5702 ± 0.0007 Å |
α | 90° |
β | 90° |
γ | 90° |
Cell volume | 1986.2 ± 0.3 Å3 |
Ambient diffraction temperature | 295 K |
Number of distinct elements | 5 |
Space group number | 205 |
Hermann-Mauguin space group symbol | P a -3 |
Hall space group symbol | -P 2ac 2ab 3 |
Residual factor R(I) for significantly intense reflections | 0.067 |
Method of determination | powder diffraction |
Diffraction radiation probe | x-ray |
Diffraction radiation wavelength | 1.54059 Å |
Diffraction radiation type | CuKα |