Information card for entry 6000735
Formula |
K O12 P3 U2 |
Title of publication |
Synthesis and characterization of uranium(IV)-bearing members of the [NZP] structural family |
Authors of publication |
Hawkins, H. T.; Spearing, D. R.; Veirs, D. K.; Danis, J. A.; Smith, D. M.; Tait, C. D.; Runde, W. H.; Spilde, M. N.; Scheetz, B. E. |
Journal of publication |
Chemistry of Materials |
Year of publication |
1999 |
Journal volume |
11 |
Pages of publication |
2851 - 2857 |
a |
17.4705 Å |
b |
6.7541 Å |
c |
8.0252 Å |
α |
90° |
β |
102.019° |
γ |
90° |
Cell volume |
926.2 Å3 |
Number of distinct elements |
4 |
Hermann-Mauguin space group symbol |
C 1 2/c 1 |
No |
No |
No |