Information card for entry 7002098
Formula | C56 H47 Cl2 O2 P3 Ru |
Calculated formula | C56 H47 Cl2 O2 P3 Ru |
SMILES | [RuH2]1([P](c2c(Oc3c([P]1(c1ccccc1)c1ccccc1)cccc3)cccc2)(c1ccccc1)c1ccccc1)([P](c1ccccc1)(c1ccccc1)c1ccccc1)C#[O].ClCCl |
Title of publication | [Ru(NHC)(xantphos)(CO)H2] complexes: intramolecular C‒H activation and applications in C‒C bond formation |
Authors of publication | Ledger, Araminta E. W.; Mahon, Mary F.; Whittlesey, Michael K.; Williams, Jonathan M. J. |
Journal of publication | Dalton Transactions |
Year of publication | 2009 |
Journal issue | 35 |
Pages of publication | 6941 |
a | 10.494 ± 0.0002 Å |
b | 12.34 ± 0.0002 Å |
c | 19.125 ± 0.0003 Å |
α | 71.974 ± 0.001° |
β | 82.158 ± 0.001° |
γ | 89.664 ± 0.001° |
Cell volume | 2331.29 ± 0.07 Å3 |
Cell temperature | 150 ± 2 K |
Ambient diffraction temperature | 150 ± 2 K |
Number of distinct elements | 6 |
Space group number | 2 |
Hermann-Mauguin space group symbol | P -1 |
Hall space group symbol | -P 1 |
Residual factor for all reflections | 0.0391 |
Residual factor for significantly intense reflections | 0.0321 |
Weighted residual factors for significantly intense reflections | 0.0767 |
Weighted residual factors for all reflections included in the refinement | 0.0808 |
Goodness-of-fit parameter for all reflections included in the refinement | 1.032 |
Diffraction radiation wavelength | 0.71073 Å |
Diffraction radiation type | MoKα |