Information card for entry 7002212
Common name | (2) |
Formula | C20 H25 Au Cl4 N2 |
Calculated formula | C20 H25 Au Cl4 N2 |
Title of publication | Synthesis and characterization of gold(iii) complexes possessing 2,9-dialkylphenanthroline ligands: to bind or not to bind? |
Authors of publication | Hudson, Zachary D.; Sanghvi, Chinar D.; Rhine, Melody A.; Ng, Julia J.; Bunge, Scott D.; Hardcastle, Kenneth I.; Saadein, Mohammad R.; MacBeth, Cora E.; Eichler, Jack F. |
Journal of publication | Dalton Transactions |
Year of publication | 2009 |
Journal issue | 36 |
Pages of publication | 7473 - 7480 |
a | 9.013 ± 0.002 Å |
b | 10.472 ± 0.003 Å |
c | 11.909 ± 0.003 Å |
α | 92.196 ± 0.004° |
β | 93.497 ± 0.004° |
γ | 97.375 ± 0.004° |
Cell volume | 1111.4 ± 0.5 Å3 |
Cell temperature | 160 ± 2 K |
Ambient diffraction temperature | 160 ± 2 K |
Number of distinct elements | 5 |
Space group number | 2 |
Hermann-Mauguin space group symbol | P -1 |
Hall space group symbol | -P 1 |
Residual factor for all reflections | 0.0547 |
Residual factor for significantly intense reflections | 0.0321 |
Weighted residual factors for significantly intense reflections | 0.0772 |
Weighted residual factors for all reflections included in the refinement | 0.0871 |
Goodness-of-fit parameter for all reflections included in the refinement | 1.036 |
Diffraction radiation wavelength | 0.71073 Å |
Diffraction radiation type | MoKα |