Information card for entry 7002298
Chemical name | {propane-1,3-diylbis[(methylimino)methylene-2,1-phenylene]}- bis(trimethylstibonium) iodide chloroform solvate |
Formula | C25.333 H42.333 Cl I2 N2 Sb2 |
Calculated formula | C25.3333 H42.3333 Cl I2 N2 Sb2 |
Title of publication | Preparation and properties of cyclic and open-chain Sb/N-donor ligands |
Authors of publication | Jura, Marek; Levason, William; Reid, Gillian; Webster, Michael |
Journal of publication | Dalton Transactions |
Year of publication | 2009 |
Journal issue | 37 |
Pages of publication | 7811 - 7819 |
a | 13.7732 ± 0.001 Å |
b | 13.7732 ± 0.001 Å |
c | 29.544 ± 0.003 Å |
α | 90° |
β | 90° |
γ | 120° |
Cell volume | 4853.7 ± 0.7 Å3 |
Cell temperature | 120 ± 2 K |
Ambient diffraction temperature | 120 ± 2 K |
Number of distinct elements | 6 |
Space group number | 176 |
Hermann-Mauguin space group symbol | P 63/m |
Hall space group symbol | -P 6c |
Residual factor for all reflections | 0.0513 |
Residual factor for significantly intense reflections | 0.0344 |
Weighted residual factors for significantly intense reflections | 0.0636 |
Weighted residual factors for all reflections included in the refinement | 0.0692 |
Goodness-of-fit parameter for all reflections included in the refinement | 1.038 |
Diffraction radiation wavelength | 0.71073 Å |
Diffraction radiation type | MoKα |