Information card for entry 7002321
Formula |
C36 H36 F6 Mn N4 O6 S2 |
Calculated formula |
C36 H36 F6 Mn N4 O6 S2 |
SMILES |
[Mn]12([n]3ccccc3c3[n]1c1c(cc3)[C@@H]3C[C@H](C1)C3(C)C)(OS(=O)(=O)C(F)(F)F)([n]1ccccc1c1[n]2c2c(cc1)[C@@H]1C[C@H](C2)C1(C)C)OS(=O)(=O)C(F)(F)F |
Title of publication |
Mn(ii) complexes containing the polypyridylic chiral ligand (−)-pinene[5,6]bipyridine. Catalysts for oxidation reactions |
Authors of publication |
Rich, Jordi; Rodríguez, Montserrat; Romero, Isabel; Vaquer, Lydia; Sala, Xavier; Llobet, Antoni; Corbella, Montserrat; Collomb, Marie-Noëlle; Fontrodona, Xavier |
Journal of publication |
Dalton Transactions |
Year of publication |
2009 |
Journal issue |
38 |
Pages of publication |
8117 - 8126 |
a |
9.34 ± 0.005 Å |
b |
18.511 ± 0.009 Å |
c |
21.713 ± 0.011 Å |
α |
90° |
β |
90° |
γ |
90° |
Cell volume |
3754 ± 3 Å3 |
Cell temperature |
100 ± 2 K |
Ambient diffraction temperature |
100 ± 2 K |
Number of distinct elements |
7 |
Space group number |
19 |
Hermann-Mauguin space group symbol |
P 21 21 21 |
Hall space group symbol |
P 2ac 2ab |
Residual factor for all reflections |
0.1022 |
Residual factor for significantly intense reflections |
0.0539 |
Weighted residual factors for significantly intense reflections |
0.1143 |
Weighted residual factors for all reflections included in the refinement |
0.1334 |
Goodness-of-fit parameter for all reflections included in the refinement |
1.022 |
Diffraction radiation wavelength |
0.71073 Å |
Diffraction radiation type |
MoKα |
Yes |
No |
No |