Information card for entry 7002394
Formula | C58 H72 Ag6 N26 S6 |
Calculated formula | C58 H72 Ag6 N26 S6 |
Title of publication | Coordinative trends of a tridentate thiosemicarbazone ligand: synthesis, characterization, luminescence studies and desulfurization processes |
Authors of publication | Pedrido, Rosa; Romero, María J.; Bermejo, Manuel R.; Martínez-Calvo, Miguel; González-Noya, Ana M.; Zaragoza, Guillermo |
Journal of publication | Dalton Transactions |
Year of publication | 2009 |
Journal issue | 39 |
Pages of publication | 8329 - 8340 |
a | 15.997 ± 0.003 Å |
b | 16.404 ± 0.003 Å |
c | 16.081 ± 0.003 Å |
α | 90° |
β | 114.899 ± 0.002° |
γ | 90° |
Cell volume | 3827.7 ± 1.2 Å3 |
Cell temperature | 293 ± 2 K |
Ambient diffraction temperature | 293 ± 2 K |
Number of distinct elements | 5 |
Space group number | 14 |
Hermann-Mauguin space group symbol | P 1 21/c 1 |
Hall space group symbol | -P 2ybc |
Residual factor for all reflections | 0.0719 |
Residual factor for significantly intense reflections | 0.0365 |
Weighted residual factors for significantly intense reflections | 0.0753 |
Weighted residual factors for all reflections included in the refinement | 0.0913 |
Goodness-of-fit parameter for all reflections included in the refinement | 1.046 |
Diffraction radiation probe | x-ray |
Diffraction radiation wavelength | 0.7107 Å |
Diffraction radiation type | MoKα |