Information card for entry 7002398
Formula | C26 H26 Cu I N4 O S2 |
Calculated formula | C26 H26 Cu I N4 O S2 |
SMILES | [Cu](I)([S]=C(Nc1ccccc1)Nc1ccccc1)[S]=C(Nc1ccccc1)Nc1ccccc1.O |
Title of publication | Spectroscopy and structures of two complete families, one mononuclear, the other binuclear, of 1 : 2 CuX : dptu stoichiometry (X = Cl, Br, I; ‘dptu’ = N,N′-diphenylthiourea) |
Authors of publication | Bowmaker, Graham A.; Chaichit, Narongsak; Hanna, John V.; Pakawatchai, Chaveng; Skelton, Brian W.; White, Allan H. |
Journal of publication | Dalton Transactions |
Year of publication | 2009 |
Journal issue | 39 |
Pages of publication | 8308 - 8316 |
a | 9.5132 ± 0.0003 Å |
b | 12.4449 ± 0.0003 Å |
c | 12.7948 ± 0.0002 Å |
α | 91.807 ± 0.002° |
β | 73.165 ± 0.002° |
γ | 69.216 ± 0.003° |
Cell volume | 1340.16 ± 0.07 Å3 |
Cell temperature | 100 ± 2 K |
Ambient diffraction temperature | 100 ± 2 K |
Number of distinct elements | 7 |
Space group number | 2 |
Hermann-Mauguin space group symbol | P -1 |
Hall space group symbol | -P 1 |
Residual factor for all reflections | 0.0595 |
Residual factor for significantly intense reflections | 0.0315 |
Weighted residual factors for significantly intense reflections | 0.0736 |
Weighted residual factors for all reflections included in the refinement | 0.0903 |
Goodness-of-fit parameter for all reflections included in the refinement | 0.945 |
Diffraction radiation wavelength | 0.71073 Å |
Diffraction radiation type | MoKα |