Information card for entry 7002424
Formula | C35.6 H34.4 F6 O7.8 P2 S2 |
Calculated formula | C35.6 H32.4 F6 O7.8 P2 S2 |
Title of publication | Vicinal diphosphoniums: electrostatic repulsion under covalent constraint |
Authors of publication | Abdalilah, Mohammed; Zurawinski, Remigiuz; Canac, Yves; Laleu, Benoît; Lacour, Jérôme; Lepetit, Christine; Magro, Germinal; Bernardinelli, Gérald; Donnadieu, Bruno; Duhayon, Carine; Mikolajczyk, Marian; Chauvin, Remi |
Journal of publication | Dalton Transactions |
Year of publication | 2009 |
Journal issue | 40 |
Pages of publication | 8493 - 8508 |
a | 10.799 ± 0.002 Å |
b | 12.013 ± 0.002 Å |
c | 15.743 ± 0.003 Å |
α | 90° |
β | 97.25 ± 0.03° |
γ | 90° |
Cell volume | 2026 ± 0.6 Å3 |
Cell temperature | 295 K |
Ambient diffraction temperature | 295 K |
Number of distinct elements | 6 |
Space group number | 13 |
Hermann-Mauguin space group symbol | P 1 2/c 1 |
Hall space group symbol | -P 2yc |
Residual factor for all reflections | 0.0979 |
Residual factor for significantly intense reflections | 0.0561 |
Weighted residual factors for significantly intense reflections | 0.1394 |
Weighted residual factors for all reflections included in the refinement | 0.1652 |
Goodness-of-fit parameter for all reflections included in the refinement | 0.933 |
Diffraction radiation wavelength | 0.71073 Å |
Diffraction radiation type | MoKα |