Information card for entry 7002507
Formula | C35 H75 N2 P4 Pt Te2 |
Calculated formula | C35 H75 N2 P4 Pt Te2 |
Title of publication | Palladium and platinum complexes of tellurium-containing imidodiphosphinate ligands: nucleophilic attack of Li[(PiPr2)(TePiPr2)N] on coordinated 1,5-cyclooctadiene |
Authors of publication | Robertson, Stuart D.; Ritch, Jamie S.; Chivers, Tristram |
Journal of publication | Dalton Transactions |
Year of publication | 2009 |
Journal issue | 40 |
Pages of publication | 8582 - 8592 |
a | 16.008 ± 0.003 Å |
b | 18.866 ± 0.004 Å |
c | 14.822 ± 0.003 Å |
α | 90° |
β | 105.07 ± 0.03° |
γ | 90° |
Cell volume | 4322.4 ± 1.6 Å3 |
Cell temperature | 173 ± 2 K |
Ambient diffraction temperature | 173 ± 2 K |
Number of distinct elements | 6 |
Space group number | 14 |
Hermann-Mauguin space group symbol | P 1 21/c 1 |
Hall space group symbol | -P 2ybc |
Residual factor for all reflections | 0.0633 |
Residual factor for significantly intense reflections | 0.053 |
Weighted residual factors for significantly intense reflections | 0.124 |
Weighted residual factors for all reflections included in the refinement | 0.1313 |
Goodness-of-fit parameter for all reflections included in the refinement | 1.129 |
Diffraction radiation wavelength | 0.71073 Å |
Diffraction radiation type | MoKα |