Information card for entry 7002513
Formula | C105 H116 B2 Cl6 N18 O12 P4 Rh2 S6 |
Calculated formula | C105 H116 B2 Cl6 N18 O12 P4 Rh2 S6 |
Title of publication | A novel route to rhodaboratranes [Rh(CO)(PR3){B(taz)3}]+via the redox activation of scorpionate complexes [RhLL′Tt] |
Authors of publication | Blagg, Robin J.; Adams, Christopher J.; Charmant, Jonathan P. H.; Connelly, Neil G.; Haddow, Mairi F.; Hamilton, Alex; Knight, James; Orpen, A. Guy; Ridgway, Benjamin M. |
Journal of publication | Dalton Transactions |
Year of publication | 2009 |
Journal issue | 40 |
Pages of publication | 8724 - 8736 |
a | 10.309 ± 0.002 Å |
b | 14.935 ± 0.003 Å |
c | 19.807 ± 0.004 Å |
α | 102.89 ± 0.03° |
β | 91.48 ± 0.03° |
γ | 94.73 ± 0.03° |
Cell volume | 2959.5 ± 1.1 Å3 |
Cell temperature | 173 ± 2 K |
Ambient diffraction temperature | 173 ± 2 K |
Number of distinct elements | 9 |
Space group number | 2 |
Hermann-Mauguin space group symbol | P -1 |
Hall space group symbol | -P 1 |
Residual factor for all reflections | 0.2733 |
Residual factor for significantly intense reflections | 0.1098 |
Weighted residual factors for significantly intense reflections | 0.2278 |
Weighted residual factors for all reflections included in the refinement | 0.299 |
Goodness-of-fit parameter for all reflections included in the refinement | 0.978 |
Diffraction radiation wavelength | 0.71073 Å |
Diffraction radiation type | MoKα |