Information card for entry 7002583
Common name | Compound 2 |
Formula | C41 H54 F6 N O3 V |
Calculated formula | C41 H54 F6 N O3 V |
Title of publication | Vanadium-based imido-alkoxide pro-catalysts bearing bisphenolate ligands for ethylene and ε-caprolactone polymerisation |
Authors of publication | Arbaoui, Abdessamad; Redshaw, Carl; Homden, Damien M.; Wright, Joseph A.; Elsegood, Mark R. J. |
Journal of publication | Dalton Transactions |
Year of publication | 2009 |
Journal issue | 41 |
Pages of publication | 8911 - 8922 |
a | 10.2039 ± 0.0006 Å |
b | 19.5337 ± 0.0011 Å |
c | 10.3267 ± 0.0006 Å |
α | 90° |
β | 91.0073 ± 0.0009° |
γ | 90° |
Cell volume | 2058 ± 0.2 Å3 |
Cell temperature | 150 ± 2 K |
Ambient diffraction temperature | 150 ± 2 K |
Number of distinct elements | 6 |
Space group number | 4 |
Hermann-Mauguin space group symbol | P 1 21 1 |
Hall space group symbol | P 2yb |
Residual factor for all reflections | 0.0441 |
Residual factor for significantly intense reflections | 0.0411 |
Weighted residual factors for significantly intense reflections | 0.1081 |
Weighted residual factors for all reflections included in the refinement | 0.1109 |
Goodness-of-fit parameter for all reflections included in the refinement | 1.018 |
Diffraction radiation wavelength | 0.71073 Å |
Diffraction radiation type | MoKα |