Information card for entry 7002595
Common name | Compound 3 |
Formula | C68 H100 N6 O8 S2 V2 |
Calculated formula | C68 H100 N6 O8 S2 V2 |
Title of publication | Synthesis, structure and ethylene polymerisation behaviour of vanadium(iv and v) complexes bearing chelating aryloxides |
Authors of publication | Homden, Damien; Redshaw, Carl; Warford, Lee; Hughes, David L.; Wright, Joseph A.; Dale, Sophie H.; Elsegood, Mark R. J. |
Journal of publication | Dalton Transactions |
Year of publication | 2009 |
Journal issue | 41 |
Pages of publication | 8900 - 8910 |
a | 16.4675 ± 0.0005 Å |
b | 15.2783 ± 0.0005 Å |
c | 29.5448 ± 0.0009 Å |
α | 90° |
β | 90° |
γ | 90° |
Cell volume | 7433.3 ± 0.4 Å3 |
Cell temperature | 150 ± 2 K |
Ambient diffraction temperature | 150 ± 2 K |
Number of distinct elements | 6 |
Space group number | 61 |
Hermann-Mauguin space group symbol | P b c a |
Hall space group symbol | -P 2ac 2ab |
Residual factor for all reflections | 0.0717 |
Residual factor for significantly intense reflections | 0.0435 |
Weighted residual factors for significantly intense reflections | 0.1057 |
Weighted residual factors for all reflections included in the refinement | 0.1309 |
Goodness-of-fit parameter for all reflections included in the refinement | 1.1 |
Diffraction radiation wavelength | 0.71073 Å |
Diffraction radiation type | MoKα |