Information card for entry 7002671
Formula | C58 H50 Cu4 F12 N4 O11 |
Calculated formula | C58 H50 Cu4 F12 N4 O11 |
Title of publication | Four μ4-oxo-bridged copper(ii) complexes: magnetic properties and catalytic applications in liquid phase partial oxidation reactions |
Authors of publication | Roy, Partha; Nandi, Mahasweta; Manassero, Mario; Riccó, Mauro; Mazzani, Marcello; Bhaumik, Asim; Banerjee, Pradyot |
Journal of publication | Dalton Transactions |
Year of publication | 2009 |
Journal issue | 43 |
Pages of publication | 9543 - 9554 |
a | 12.4065 ± 0.0007 Å |
b | 15.4152 ± 0.0008 Å |
c | 16.9396 ± 0.0009 Å |
α | 99.45 ± 0.002° |
β | 91.15 ± 0.002° |
γ | 93.01 ± 0.002° |
Cell volume | 3189.9 ± 0.3 Å3 |
Cell temperature | 296 K |
Ambient diffraction temperature | 296 K |
Number of distinct elements | 6 |
Space group number | 2 |
Hermann-Mauguin space group symbol | P -1 |
Hall space group symbol | -P 1 |
Residual factor for all reflections | 0.106 |
Residual factor for significantly intense reflections | 0.106 |
Weighted residual factors for significantly intense reflections | 0.145 |
Goodness-of-fit parameter for all reflections | 0.961 |
Goodness-of-fit parameter for significantly intense reflections | 0.961 |
Diffraction radiation wavelength | 0.71073 Å |
Diffraction radiation type | Mo-Kα |