Information card for entry 7002710
Formula | C28 H30 Cl2 F6 N2 O2 Ti |
Calculated formula | C28 H30 Cl2 F6 N2 O2 Ti |
SMILES | C1(=CC(C(C)(C)C)=[N](c2ccccc2)[Ti]2(O1)(Cl)([N](=C(C=C(C(F)(F)F)O2)C(C)(C)C)c1ccccc1)Cl)C(F)(F)F |
Title of publication | Synthesis and characterization of the titanium complexes bearing two regioisomeric trifluoromethyl-containing enaminoketonato ligands and their behavior in ethylene polymerization |
Authors of publication | Ye, Wei-Ping; Mu, Hong-Liang; Shi, Xin-Cui; Cheng, Yan-Xiang; Li, Yue-Sheng |
Journal of publication | Dalton Transactions |
Year of publication | 2009 |
Journal issue | 43 |
Pages of publication | 9452 - 9465 |
a | 6.1707 ± 0.0005 Å |
b | 19.7949 ± 0.0016 Å |
c | 12.4053 ± 0.001 Å |
α | 90° |
β | 100.778 ± 0.001° |
γ | 90° |
Cell volume | 1488.6 ± 0.2 Å3 |
Cell temperature | 187 ± 2 K |
Ambient diffraction temperature | 187 ± 2 K |
Number of distinct elements | 7 |
Space group number | 14 |
Hermann-Mauguin space group symbol | P 1 21/c 1 |
Hall space group symbol | -P 2ybc |
Residual factor for all reflections | 0.0711 |
Residual factor for significantly intense reflections | 0.0496 |
Weighted residual factors for significantly intense reflections | 0.145 |
Weighted residual factors for all reflections included in the refinement | 0.1618 |
Goodness-of-fit parameter for all reflections included in the refinement | 1.051 |
Diffraction radiation wavelength | 0.71073 Å |
Diffraction radiation type | MoKα |