Information card for entry 7002780
Formula | C11 H14 Mo O S |
Calculated formula | C11 H14 Mo O S |
SMILES | [Mo]12345([C](#[C]1C)C)(C#[O])(SC)[cH]1[cH]2[cH]3[cH]4[cH]51 |
Title of publication | Thiolates vs. halides as π-donors: the redox-active alkyne complexes [M(SR)L(η-R′CCR′)L′] {M = Mo or W, L = CO or P(OMe)3, L′ = η-C5H5 and Tp′} |
Authors of publication | Adams, Christopher J.; Baber, Angharad; Boonyuen, Supakorn; Connelly, Neil G.; Diosdado, Beatriz E.; Kantacha, Anob; Orpen, A. Guy; Patrón, Elena |
Journal of publication | Dalton Transactions |
Year of publication | 2009 |
Journal issue | 44 |
Pages of publication | 9746 - 9758 |
a | 13.771 ± 0.003 Å |
b | 12.51 ± 0.003 Å |
c | 6.9506 ± 0.0014 Å |
α | 90° |
β | 101.33 ± 0.03° |
γ | 90° |
Cell volume | 1174.1 ± 0.5 Å3 |
Cell temperature | 100 ± 2 K |
Ambient diffraction temperature | 100 ± 2 K |
Number of distinct elements | 5 |
Space group number | 14 |
Hermann-Mauguin space group symbol | P 1 21/c 1 |
Hall space group symbol | -P 2ybc |
Residual factor for all reflections | 0.0315 |
Residual factor for significantly intense reflections | 0.0254 |
Weighted residual factors for significantly intense reflections | 0.0561 |
Weighted residual factors for all reflections included in the refinement | 0.0581 |
Goodness-of-fit parameter for all reflections included in the refinement | 1.008 |
Diffraction radiation wavelength | 0.71073 Å |
Diffraction radiation type | MoKα |