Information card for entry 7002829
Formula | C72 H100.36 Ag12 O32.18 |
Calculated formula | C72 H100.36 Ag12 O32.18 |
Title of publication | New types of di-, tetra-, hexa- and octanuclear Ag(i) complexes containing 1,3-adamantanedicarboxylic acid |
Authors of publication | Jin, Jun-Cheng; Wang, Yao-Yu; Zhang, Wei-Hong; Lermontov, Anatoly S.; Lermontova, Elmira Kh.; Shi, Qi-Zhen |
Journal of publication | Dalton Transactions |
Year of publication | 2009 |
Journal issue | 46 |
Pages of publication | 10181 - 10191 |
a | 18.48 ± 0.004 Å |
b | 13.463 ± 0.003 Å |
c | 18.374 ± 0.004 Å |
α | 90° |
β | 110.22 ± 0.004° |
γ | 90° |
Cell volume | 4289.7 ± 1.6 Å3 |
Cell temperature | 293 ± 2 K |
Ambient diffraction temperature | 293 ± 2 K |
Number of distinct elements | 4 |
Space group number | 13 |
Hermann-Mauguin space group symbol | P 1 2/c 1 |
Hall space group symbol | -P 2yc |
Residual factor for all reflections | 0.1078 |
Residual factor for significantly intense reflections | 0.0474 |
Weighted residual factors for significantly intense reflections | 0.1202 |
Weighted residual factors for all reflections included in the refinement | 0.1359 |
Goodness-of-fit parameter for all reflections included in the refinement | 0.853 |
Diffraction radiation wavelength | 0.71073 Å |
Diffraction radiation type | MoKα |