Information card for entry 7002833
Formula |
C22 H25 Ag N2 O5 |
Calculated formula |
C22 H25 Ag N2 O5 |
Title of publication |
New types of di-, tetra-, hexa- and octanuclear Ag(i) complexes containing 1,3-adamantanedicarboxylic acid |
Authors of publication |
Jin, Jun-Cheng; Wang, Yao-Yu; Zhang, Wei-Hong; Lermontov, Anatoly S.; Lermontova, Elmira Kh.; Shi, Qi-Zhen |
Journal of publication |
Dalton Transactions |
Year of publication |
2009 |
Journal issue |
46 |
Pages of publication |
10181 - 10191 |
a |
11.498 ± 0.002 Å |
b |
6.9069 ± 0.0014 Å |
c |
13.575 ± 0.003 Å |
α |
90° |
β |
113.8 ± 0.003° |
γ |
90° |
Cell volume |
986.4 ± 0.3 Å3 |
Cell temperature |
293 ± 2 K |
Ambient diffraction temperature |
293 ± 2 K |
Number of distinct elements |
5 |
Space group number |
11 |
Hermann-Mauguin space group symbol |
P 1 21/m 1 |
Hall space group symbol |
-P 2yb |
Residual factor for all reflections |
0.0593 |
Residual factor for significantly intense reflections |
0.0493 |
Weighted residual factors for significantly intense reflections |
0.1169 |
Weighted residual factors for all reflections included in the refinement |
0.1261 |
Goodness-of-fit parameter for all reflections included in the refinement |
1.065 |
Diffraction radiation wavelength |
0.71073 Å |
Diffraction radiation type |
MoKα |
Yes |
No |
No |