Information card for entry 7002881
Formula | C36 H36 N8 Nd2 O10 |
Calculated formula | C36 H32 N8 Nd2 O10 |
SMILES | N1(=[O][Nd]23456(O1)Oc1ccccc1C=[N]2CC[NH]3CC[N]4=Cc1ccccc1[O]6[Nd]12346(ON(=[O]1)=O)Oc1ccccc1C=[N]2CC[NH]3CC[N]4=Cc1ccccc1[O]56)=O |
Title of publication | Syntheses, characterisation, magnetism and photoluminescence of a homodinuclear Ln(III)-Schiff base family |
Authors of publication | Chakraborty, Joy; Ray, Aurkie; Pilet, Guillaume; Chastanet, Guillaume; Luneau, Dominique; Ziessel, Raymond F.; Charbonnière, Loïc J.; Carrella, Luca; Rentschler, Eva; El Fallah, M. S.; Mitra, Samiran |
Journal of publication | Dalton Transactions |
Year of publication | 2009 |
Journal issue | 46 |
Pages of publication | 10263 - 10272 |
a | 12.911 ± 0.005 Å |
b | 11.938 ± 0.005 Å |
c | 13.96 ± 0.005 Å |
α | 90° |
β | 110.732 ± 0.005° |
γ | 90° |
Cell volume | 2012.3 ± 1.4 Å3 |
Cell temperature | 293 ± 1 K |
Ambient diffraction temperature | 293 ± 1 K |
Number of distinct elements | 5 |
Space group number | 14 |
Hermann-Mauguin space group symbol | P 1 21/n 1 |
Hall space group symbol | -P 2yn |
Residual factor for all reflections | 0.0732 |
Residual factor for significantly intense reflections | 0.0385 |
Weighted residual factors for all reflections | 0.0685 |
Weighted residual factors for significantly intense reflections | 0.0455 |
Weighted residual factors for all reflections included in the refinement | 0.0455 |
Goodness-of-fit parameter for all reflections included in the refinement | 1.1014 |
Diffraction radiation wavelength | 0.71069 Å |
Diffraction radiation type | MoKα |