Information card for entry 7002886
Formula | C20 H19 I2 N3 Pd |
Calculated formula | C20 H19 I2 N3 Pd |
SMILES | [Pd](I)(I)([n]1ccccc1)=C1n2c(=N(=C1c1ccccc1)C)c(C)ccc2 |
Title of publication | Palladium complexes of abnormal N-heterocyclic carbenes as precatalysts for the much preferred Cu-free and amine-free Sonogashira coupling in air in a mixed-aqueous medium |
Authors of publication | John, Alex; Shaikh, Mobin M.; Ghosh, Prasenjit |
Journal of publication | Dalton Transactions |
Year of publication | 2009 |
Journal issue | 47 |
Pages of publication | 10581 - 10591 |
a | 10.1323 ± 0.0002 Å |
b | 14.5426 ± 0.0003 Å |
c | 14.3889 ± 0.0003 Å |
α | 90° |
β | 92.569 ± 0.002° |
γ | 90° |
Cell volume | 2118.07 ± 0.07 Å3 |
Cell temperature | 150 ± 2 K |
Ambient diffraction temperature | 150 ± 2 K |
Number of distinct elements | 5 |
Space group number | 14 |
Hermann-Mauguin space group symbol | P 1 21/n 1 |
Hall space group symbol | -P 2yn |
Residual factor for all reflections | 0.0223 |
Residual factor for significantly intense reflections | 0.0175 |
Weighted residual factors for significantly intense reflections | 0.0392 |
Weighted residual factors for all reflections included in the refinement | 0.0402 |
Goodness-of-fit parameter for all reflections included in the refinement | 1.034 |
Diffraction radiation wavelength | 0.71073 Å |
Diffraction radiation type | MoKα |