Information card for entry 7002891
Formula | C76 H66 La2 N24 O17 |
Calculated formula | C76 H66 La2 N24 O17 |
Title of publication | Systematic investigation of an array of TCNQ lanthanide complexes: synthesis, structure and magnetic properties |
Authors of publication | Zhang, Juwen; Yan, Pengfei; Li, Guangming; Hou, Guangfeng; Suda, Masayuki; Einaga, Yasuaki |
Journal of publication | Dalton Transactions |
Year of publication | 2009 |
Journal issue | 47 |
Pages of publication | 10466 - 10473 |
a | 11.8868 ± 0.0014 Å |
b | 13.6725 ± 0.0015 Å |
c | 14.0053 ± 0.0016 Å |
α | 105.727 ± 0.002° |
β | 102.179 ± 0.002° |
γ | 100.52 ± 0.002° |
Cell volume | 2071 ± 0.4 Å3 |
Cell temperature | 293 ± 2 K |
Ambient diffraction temperature | 293 ± 2 K |
Number of distinct elements | 5 |
Space group number | 2 |
Hermann-Mauguin space group symbol | P -1 |
Hall space group symbol | -P 1 |
Residual factor for all reflections | 0.0668 |
Residual factor for significantly intense reflections | 0.0547 |
Weighted residual factors for significantly intense reflections | 0.14 |
Weighted residual factors for all reflections included in the refinement | 0.1485 |
Goodness-of-fit parameter for all reflections included in the refinement | 1.071 |
Diffraction radiation wavelength | 0.71073 Å |
Diffraction radiation type | MoKα |