Information card for entry 7002908
Formula | C39.5 H41 Mn2 N10 O9.5 |
Calculated formula | C39.5 H41 Mn2 N10 O9.5 |
Title of publication | Synthesis, structures and magnetic properties of polynuclear mixed-valence MnIIMnIII complexes containing 3-(2-phenol)-5-(pyridin-2-yl)-1,2,4-triazole ligand |
Authors of publication | Liu, Hui; Tian, Jinlei; Kou, Yingying; Zhang, Jingyan; Feng, Li; Li, Dongdong; Gu, Wen; Liu, Xin; Liao, Daizheng; Cheng, Peng; Ribas, Joan; Yan, Shiping |
Journal of publication | Dalton Transactions |
Year of publication | 2009 |
Journal issue | 47 |
Pages of publication | 10511 - 10517 |
a | 21.667 ± 0.006 Å |
b | 19.462 ± 0.005 Å |
c | 22.363 ± 0.006 Å |
α | 90° |
β | 116.436 ± 0.003° |
γ | 90° |
Cell volume | 8444 ± 4 Å3 |
Cell temperature | 113 ± 2 K |
Ambient diffraction temperature | 113 ± 2 K |
Number of distinct elements | 5 |
Space group number | 15 |
Hermann-Mauguin space group symbol | C 1 2/c 1 |
Hall space group symbol | -C 2yc |
Residual factor for all reflections | 0.0518 |
Residual factor for significantly intense reflections | 0.0458 |
Weighted residual factors for significantly intense reflections | 0.1231 |
Weighted residual factors for all reflections included in the refinement | 0.128 |
Goodness-of-fit parameter for all reflections included in the refinement | 1.091 |
Diffraction radiation wavelength | 0.7107 Å |
Diffraction radiation type | MoKα |