Information card for entry 7002916
Common name | (La(DBP)3(H-TMG)) (6) |
Formula | C55 H92 La N3 O5 |
Calculated formula | C47 H75 La N3 O3 |
Title of publication | 1,1,3,3-Tetramethylguanidine solvated lanthanide aryloxides: pre-catalysts for intramolecular hydroalkoxylation |
Authors of publication | Janini, Thomas E.; Rakosi, III, Robert; Durr, Christopher B.; Bertke, Jeffrey A.; Bunge, Scott D. |
Journal of publication | Dalton Transactions |
Year of publication | 2009 |
Journal issue | 47 |
Pages of publication | 10601 - 10608 |
a | 14.3312 ± 0.0016 Å |
b | 19.335 ± 0.002 Å |
c | 20.493 ± 0.002 Å |
α | 90° |
β | 104.958 ± 0.002° |
γ | 90° |
Cell volume | 5486.1 ± 1 Å3 |
Cell temperature | 100 ± 2 K |
Ambient diffraction temperature | 100 ± 2 K |
Number of distinct elements | 5 |
Space group number | 14 |
Hermann-Mauguin space group symbol | P 1 21/n 1 |
Hall space group symbol | -P 2yn |
Residual factor for all reflections | 0.0674 |
Residual factor for significantly intense reflections | 0.0586 |
Weighted residual factors for significantly intense reflections | 0.1446 |
Weighted residual factors for all reflections included in the refinement | 0.1503 |
Goodness-of-fit parameter for all reflections included in the refinement | 0.886 |
Diffraction radiation wavelength | 0.71073 Å |
Diffraction radiation type | MoKα |