Information card for entry 7003000
Formula | C72 H52 Cl4 Co2 N4 O32 |
Calculated formula | C72 H52 Cl4 Co2 N4 O32 |
Title of publication | Divalent later transition metal complexes of the traditional chinese medicine (TCM) liriodenine: coordination chemistry, cytotoxicity and DNA binding studies |
Authors of publication | Liu, Yan-Cheng; Chen, Zhen-Feng; Liu, Li-Min; Peng, Yan; Hong, Xue; Yang, Bin; Liu, Hua-Gang; Liang, Hong; Orvig, Chris |
Journal of publication | Dalton Transactions |
Year of publication | 2009 |
Journal issue | 48 |
Pages of publication | 10813 - 10823 |
a | 11.226 ± 0.003 Å |
b | 11.564 ± 0.003 Å |
c | 14.772 ± 0.003 Å |
α | 91.866 ± 0.005° |
β | 96.362 ± 0.004° |
γ | 115.633 ± 0.006° |
Cell volume | 1711.3 ± 0.7 Å3 |
Cell temperature | 193 ± 2 K |
Ambient diffraction temperature | 193 ± 2 K |
Number of distinct elements | 6 |
Space group number | 2 |
Hermann-Mauguin space group symbol | P -1 |
Hall space group symbol | -P 1 |
Residual factor for all reflections | 0.1321 |
Residual factor for significantly intense reflections | 0.0947 |
Weighted residual factors for significantly intense reflections | 0.2446 |
Weighted residual factors for all reflections included in the refinement | 0.2762 |
Goodness-of-fit parameter for all reflections included in the refinement | 1.12 |
Diffraction radiation wavelength | 0.7107 Å |
Diffraction radiation type | MoKα |