Information card for entry 7003014
Formula | C36 H70 Ho2 N4 O4 |
Calculated formula | C36 H70 Ho2 N4 O4 |
SMILES | [c]12([c]3([c]4([c]5([c]1(C)[Ho]1672345(O[N]1(CC)CC)[N]([O]6[Ho]123456([c]8([c]1([c]2([c]3([c]48C)C)C)C)C)([N]([O]75)(CC)CC)[N](O6)(CC)CC)(CC)CC)C)C)C)C |
Title of publication | Bis(hydroxylaminato)-mono(pentamethylcyclopentadienyl) rare-earth metal complexes |
Authors of publication | Venugopal, Ajay; Pape, Tania; Willner, Alexander; Mitzel, Norbert W. |
Journal of publication | Dalton Transactions |
Year of publication | 2009 |
Journal issue | 29 |
Pages of publication | 5715 - 5719 |
a | 14.1189 ± 0.0016 Å |
b | 13.0204 ± 0.0015 Å |
c | 21.678 ± 0.003 Å |
α | 90° |
β | 90° |
γ | 90° |
Cell volume | 3985.1 ± 0.8 Å3 |
Cell temperature | 153 ± 2 K |
Ambient diffraction temperature | 153 ± 2 K |
Number of distinct elements | 5 |
Space group number | 61 |
Hermann-Mauguin space group symbol | P b c a |
Hall space group symbol | -P 2ac 2ab |
Residual factor for all reflections | 0.0377 |
Residual factor for significantly intense reflections | 0.0327 |
Weighted residual factors for significantly intense reflections | 0.0622 |
Weighted residual factors for all reflections included in the refinement | 0.0637 |
Goodness-of-fit parameter for all reflections included in the refinement | 1.269 |
Diffraction radiation wavelength | 0.71073 Å |
Diffraction radiation type | MoKα |