Information card for entry 7003105
Formula | C87 H106 Cu6 N6 O31 Ti4 |
Calculated formula | C87 H106 Cu6 N6 O31 Ti4 |
Title of publication | Single source heterobimetallic precursors for the deposition of Cu‒Ti mixed metal oxide thin films |
Authors of publication | Tahir, Asif Ali; Hamid, Mazhar; Mazhar, Muhammad; Zeller, Matthias; Hunter, Allen D.; Nadeem, Muhammad; Akhtar, Muhammad Javed |
Journal of publication | Dalton Transactions |
Year of publication | 2008 |
Journal issue | 9 |
Pages of publication | 1224 - 1232 |
a | 16.427 ± 0.006 Å |
b | 17.267 ± 0.006 Å |
c | 21.893 ± 0.007 Å |
α | 102.256 ± 0.007° |
β | 99.706 ± 0.007° |
γ | 92.352 ± 0.007° |
Cell volume | 5962 ± 4 Å3 |
Cell temperature | 100 ± 2 K |
Ambient diffraction temperature | 100 ± 2 K |
Number of distinct elements | 6 |
Space group number | 2 |
Hermann-Mauguin space group symbol | P -1 |
Hall space group symbol | -P 1 |
Residual factor for all reflections | 0.1151 |
Residual factor for significantly intense reflections | 0.0601 |
Weighted residual factors for significantly intense reflections | 0.1285 |
Weighted residual factors for all reflections included in the refinement | 0.1425 |
Goodness-of-fit parameter for all reflections included in the refinement | 0.866 |
Diffraction radiation wavelength | 0.71073 Å |
Diffraction radiation type | MoKα |