Information card for entry 7003764
Formula | C41 H40.9 Cl0.1 N2 O2 P Ru |
Calculated formula | C41 H40.9 Cl0.1 N2 O2 P Ru |
Title of publication | Stoichiometric and catalytic reactivity of the N-heterocyclic carbene ruthenium hydride complexes [Ru(NHC)(L)(CO)HCl] and [Ru(NHC)(L)(CO)H(η2-BH4)] (L = NHC, PPh3) |
Authors of publication | Chantler, Victoria L.; Chatwin, Sarah L.; Jazzar, Rodolphe F. R.; Mahon, Mary F.; Saker, Olly; Whittlesey, Michael K. |
Journal of publication | Dalton Transactions |
Year of publication | 2008 |
Journal issue | 19 |
Pages of publication | 2603 - 2614 |
a | 15.175 ± 0.0002 Å |
b | 14.043 ± 0.0002 Å |
c | 17.277 ± 0.0002 Å |
α | 90° |
β | 100.837 ± 0.001° |
γ | 90° |
Cell volume | 3616.11 ± 0.08 Å3 |
Cell temperature | 150 ± 2 K |
Ambient diffraction temperature | 150 ± 2 K |
Number of distinct elements | 7 |
Space group number | 14 |
Hermann-Mauguin space group symbol | P 1 21/a 1 |
Hall space group symbol | -P 2yab |
Residual factor for all reflections | 0.0466 |
Residual factor for significantly intense reflections | 0.0326 |
Weighted residual factors for significantly intense reflections | 0.0742 |
Weighted residual factors for all reflections included in the refinement | 0.0814 |
Goodness-of-fit parameter for all reflections included in the refinement | 1.053 |
Diffraction radiation wavelength | 0.71073 Å |
Diffraction radiation type | MoKα |