Information card for entry 7004331
Formula | C15.25 H25.5 Cl1.5 N2 Pd |
Calculated formula | C15.25 H25.5 Cl1.5 N2 Pd |
Title of publication | Unsymmetrical bidentate ligands of α-aminoaldimines leading to sterically controlled selectivity of geometrical isomerism in square planar coordination |
Authors of publication | Lee, Jen-Jeh; Yang, Feng-Zhao; Lin, Ya-Fan; Chang, Ya-Chun; Yu, Kuo-Hsuan; Chang, Mu-Chieh; Lee, Gene-Hsiang; Liu, Yi-Hung; Wang, Yu; Liu, Shiuh-Tzung; Chen, Jwu-Ting |
Journal of publication | Dalton Transactions |
Year of publication | 2008 |
Journal issue | 43 |
Pages of publication | 5945 - 5956 |
a | 8.168 ± 0.004 Å |
b | 13.6785 ± 0.0013 Å |
c | 16.28 ± 0.006 Å |
α | 88.19 ± 0.02° |
β | 82.95 ± 0.04° |
γ | 85.21 ± 0.03° |
Cell volume | 1798.4 ± 1.1 Å3 |
Cell temperature | 295 ± 2 K |
Ambient diffraction temperature | 295 ± 2 K |
Number of distinct elements | 5 |
Space group number | 2 |
Hermann-Mauguin space group symbol | P -1 |
Hall space group symbol | -P 1 |
Residual factor for all reflections | 0.0533 |
Residual factor for significantly intense reflections | 0.0314 |
Weighted residual factors for significantly intense reflections | 0.0732 |
Weighted residual factors for all reflections included in the refinement | 0.0795 |
Goodness-of-fit parameter for all reflections included in the refinement | 1.017 |
Diffraction radiation wavelength | 0.71073 Å |
Diffraction radiation type | MoKα |