Information card for entry 7004442
Formula | C20 H20 Cl3 Co N4 O3 Zn |
Calculated formula | C20 H20 Cl3 Co N4 O3 Zn |
SMILES | [Zn](Cl)(Cl)(Cl)[O]=C1O[Co]234(O1)[n]1c(C[N]2(Cc2[n]3cccc2)CCc2cccc[n]24)cccc1 |
Title of publication | The donor ability of the chelated carbonate ligand: protonation and metallation of [(L)Co(O2CO)]+ complexes in aqueous solution |
Authors of publication | McClintock, Lisa F.; Cavigliasso, Germán; Stranger, Robert; Blackman, Allan G. |
Journal of publication | Dalton Transactions |
Year of publication | 2008 |
Journal issue | 37 |
Pages of publication | 4984 - 4992 |
a | 8.2916 ± 0.0007 Å |
b | 11.0966 ± 0.0011 Å |
c | 14.0994 ± 0.0013 Å |
α | 95.851 ± 0.004° |
β | 102.607 ± 0.004° |
γ | 108.6 ± 0.004° |
Cell volume | 1179.04 ± 0.19 Å3 |
Cell temperature | 85 ± 2 K |
Ambient diffraction temperature | 85 ± 2 K |
Number of distinct elements | 7 |
Space group number | 2 |
Hermann-Mauguin space group symbol | P -1 |
Hall space group symbol | -P 1 |
Residual factor for all reflections | 0.0521 |
Residual factor for significantly intense reflections | 0.0347 |
Weighted residual factors for significantly intense reflections | 0.077 |
Weighted residual factors for all reflections included in the refinement | 0.0815 |
Goodness-of-fit parameter for all reflections included in the refinement | 1.063 |
Diffraction radiation wavelength | 0.71073 Å |
Diffraction radiation type | MoKα |