Information card for entry 7004550
Formula | C3 H7 Gd N9 O5 |
Calculated formula | C3 H5 Gd N9 O5 |
Title of publication | Syntheses, structures and properties of seven isomorphous 1D Ln3+complexes Ln(BTA)(HCOO)(H2O)3 (H2BTA = bis(tetrazoly)amine, Ln = Pr, Gd, Eu, Tb, Dy, Er, Yb) and two 3D Ln3+ complexes Ln(HCOO)3 (Ln = Pr, Nd) |
Authors of publication | Lin, Jiao-Min; Guan, Yang-Fan; Wang, Dong-Yao; Dong, Wen; Wang, Xiu-Teng; Gao, Song |
Journal of publication | Dalton Transactions |
Year of publication | 2008 |
Journal issue | 44 |
Pages of publication | 6165 - 6169 |
a | 6.7214 ± 0.0004 Å |
b | 11.312 ± 0.0006 Å |
c | 14.2721 ± 0.0008 Å |
α | 90° |
β | 90° |
γ | 90° |
Cell volume | 1085.14 ± 0.11 Å3 |
Cell temperature | 296 ± 2 K |
Ambient diffraction temperature | 296 ± 2 K |
Number of distinct elements | 5 |
Space group number | 42 |
Hermann-Mauguin space group symbol | F m m 2 |
Hall space group symbol | F 2 -2 |
Residual factor for all reflections | 0.0269 |
Residual factor for significantly intense reflections | 0.0269 |
Weighted residual factors for significantly intense reflections | 0.0676 |
Weighted residual factors for all reflections included in the refinement | 0.0676 |
Goodness-of-fit parameter for all reflections included in the refinement | 1.24 |
Diffraction radiation wavelength | 0.71073 Å |
Diffraction radiation type | MoKα |