Information card for entry 7005445
Formula | C72 H80 N22 Nd2 O20 Ru3 |
Calculated formula | C72 H76 N22 Nd2 O20 Ru3 |
Title of publication | Three-component coordination networks based on [Ru(phen)(CN)4]2? anions, near-infrared luminescent lanthanide(iii) cations, and ancillary oligopyridine ligands: structures and photophysical properties |
Authors of publication | Baca, Svetlana G.; Adams, Harry; Sykes, Daniel; Faulkner, Stephen; Ward, Michael D. |
Journal of publication | Dalton Transactions |
Year of publication | 2007 |
Journal issue | 23 |
Pages of publication | 2419 |
a | 25.497 ± 0.003 Å |
b | 26.744 ± 0.002 Å |
c | 11.8709 ± 0.0011 Å |
α | 90° |
β | 90° |
γ | 90° |
Cell volume | 8094.7 ± 1.4 Å3 |
Cell temperature | 173 ± 2 K |
Ambient diffraction temperature | 173 ± 2 K |
Number of distinct elements | 6 |
Space group number | 60 |
Hermann-Mauguin space group symbol | P b c n |
Hall space group symbol | -P 2n 2ab |
Residual factor for all reflections | 0.0422 |
Residual factor for significantly intense reflections | 0.0344 |
Weighted residual factors for significantly intense reflections | 0.0841 |
Weighted residual factors for all reflections included in the refinement | 0.0896 |
Goodness-of-fit parameter for all reflections included in the refinement | 1.029 |
Diffraction radiation wavelength | 0.71073 Å |
Diffraction radiation type | MoKα |