Information card for entry 7005712
Formula | C18 H24 Cl3 Fe N10 O12 Rb |
Calculated formula | C18 H24 Cl3 Fe N10 O12 Rb |
SMILES | [Rb+].N12CC[N]3=Cc4[n](cc[nH]4)[Fe]453([N](CC1)=Cc1[n]4cc[nH]1)[N](CC2)=Cc1[n]5cc[nH]1.Cl(=O)(=O)(=O)[O-].Cl(=O)(=O)(=O)[O-].Cl(=O)(=O)(=O)[O-] |
Title of publication | Supramolecular assemblies prepared from an iron(ii) tripodal imidazole complex. A molecular scaffolding for the self assembly of icosahedral complexes of K+, Rb+, Cs+ and NH4+ cations |
Authors of publication | Brewer, Greg; Butcher, Ray J.; Viragh, Carol; White, Genevieve |
Journal of publication | Dalton Transactions |
Year of publication | 2007 |
Journal issue | 37 |
Pages of publication | 4132 |
a | 13.4744 ± 0.0008 Å |
b | 13.4744 ± 0.0008 Å |
c | 9.3487 ± 0.0011 Å |
α | 90° |
β | 90° |
γ | 120° |
Cell volume | 1469.9 ± 0.2 Å3 |
Cell temperature | 173 ± 2 K |
Ambient diffraction temperature | 173 ± 2 K |
Number of distinct elements | 7 |
Space group number | 147 |
Hermann-Mauguin space group symbol | P -3 |
Hall space group symbol | -P 3 |
Residual factor for all reflections | 0.0292 |
Residual factor for significantly intense reflections | 0.0233 |
Weighted residual factors for significantly intense reflections | 0.0571 |
Weighted residual factors for all reflections included in the refinement | 0.0595 |
Goodness-of-fit parameter for all reflections included in the refinement | 1.039 |
Diffraction radiation wavelength | 0.71073 Å |
Diffraction radiation type | MoKα |