Information card for entry 7005897
Common name | Silver(i) Perchlorate 4:5 Complex with Pyridazino(4,5- d)pyridazine |
Chemical name | Silver(I) Perchlorate 4:5 Complex with Pyridazino[4,5-d]pyridazine |
Formula | C30 H20 Ag4 Cl4 N20 O16 |
Calculated formula | C30 H20 Ag4 Cl3 N20 O12 |
Title of publication | Silver(I) ions bridged by pyridazine: doubling the ligand functionality for the design of unusual 3D coordination frameworks. |
Authors of publication | Konstantin V. Domasevitch; Pavlo V. Solntsev; Il'ya A. Gural'skiy; Harald Krautscheid; Eduard B. Rusanov; Alexander N. Chernega; Judith A. K. Howard |
Journal of publication | Dalton transactions (Cambridge, England : 2003) |
Year of publication | 2007 |
Journal issue | 35 |
Pages of publication | 3893 - 3905 |
a | 17.0076 ± 0.001 Å |
b | 17.0076 ± 0.001 Å |
c | 7.8591 ± 0.0005 Å |
α | 90° |
β | 90° |
γ | 90° |
Cell volume | 2273.3 ± 0.2 Å3 |
Cell temperature | 213 ± 2 K |
Ambient diffraction temperature | 213 ± 2 K |
Number of distinct elements | 6 |
Space group number | 136 |
Hermann-Mauguin space group symbol | P 42/m n m |
Hall space group symbol | -P 4n 2n |
Residual factor for all reflections | 0.039 |
Residual factor for significantly intense reflections | 0.026 |
Weighted residual factors for significantly intense reflections | 0.066 |
Weighted residual factors for all reflections included in the refinement | 0.068 |
Goodness-of-fit parameter for all reflections included in the refinement | 0.973 |
Diffraction radiation wavelength | 0.71073 Å |
Diffraction radiation type | MoKα |