Information card for entry 7006261
Formula | C19 H17 Au F9 N3 |
Calculated formula | C19.02 H17.05 Au F9 N3 |
Title of publication | Gold(i)‒carbenes derived from 4-pyridylisocyanide complexes: supramolecular macrocycles supported by hydrogen bonds, and luminescent behavior |
Authors of publication | Bartolomé, Camino; Carrasco-Rando, Marta; Coco, Silverio; Cordovilla, Carlos; Espinet, Pablo; Martín-Alvarez, Jose M. |
Journal of publication | Dalton Transactions |
Year of publication | 2007 |
Journal issue | 45 |
Pages of publication | 5339 |
a | 10.714 ± 0.003 Å |
b | 12.89 ± 0.004 Å |
c | 19.055 ± 0.006 Å |
α | 98.662 ± 0.007° |
β | 103.113 ± 0.006° |
γ | 105.187 ± 0.007° |
Cell volume | 2410.9 ± 1.3 Å3 |
Cell temperature | 298 ± 2 K |
Ambient diffraction temperature | 298 ± 2 K |
Number of distinct elements | 5 |
Space group number | 2 |
Hermann-Mauguin space group symbol | P -1 |
Hall space group symbol | -P 1 |
Residual factor for all reflections | 0.0618 |
Residual factor for significantly intense reflections | 0.0413 |
Weighted residual factors for significantly intense reflections | 0.1189 |
Weighted residual factors for all reflections included in the refinement | 0.1365 |
Goodness-of-fit parameter for all reflections included in the refinement | 1.071 |
Diffraction radiation wavelength | 0.71073 Å |
Diffraction radiation type | MoKα |