Information card for entry 7006456
Formula | C36 H84 O13 P6 Se12 Zn4 |
Calculated formula | C36 H84 O13 P6 Se12 Zn4 |
Title of publication | Coordination chemistry of Group 12 metals with phosphorodiselenoates: syntheses, structures and VT 31P NMR study of monomer-dimer exchange equilibrium. |
Authors of publication | Liu, C. W.; Lobana, Tarlok S.; Santra, Bidyut K.; Hung, Chiu-Mine; Liu, Hong-Yuan; Liaw, Ben-Jie; Wang, Ju-Chun |
Journal of publication | Dalton transactions (Cambridge, England : 2003) |
Year of publication | 2006 |
Journal issue | 4 |
Pages of publication | 560 - 570 |
a | 12.891 ± 0.002 Å |
b | 13.336 ± 0.002 Å |
c | 13.584 ± 0.002 Å |
α | 112.847 ± 0.003° |
β | 105.662 ± 0.003° |
γ | 108.246 ± 0.003° |
Cell volume | 1827.9 ± 0.5 Å3 |
Cell temperature | 298 ± 2 K |
Ambient diffraction temperature | 298 ± 2 K |
Number of distinct elements | 6 |
Space group number | 2 |
Hermann-Mauguin space group symbol | P -1 |
Hall space group symbol | -P 1 |
Residual factor for all reflections | 0.0914 |
Residual factor for significantly intense reflections | 0.0599 |
Weighted residual factors for significantly intense reflections | 0.1441 |
Weighted residual factors for all reflections included in the refinement | 0.168 |
Goodness-of-fit parameter for all reflections included in the refinement | 1.021 |
Diffraction radiation wavelength | 0.71073 Å |
Diffraction radiation type | MoKα |