Information card for entry 7008233
Formula | C15 H14 Cu N6 O5 S |
Calculated formula | C15 H12 Cu N6 O5 S |
Title of publication | Syntheses, crystal structures and properties of novel copper(II) complexes obtained by reactions of copper(II) sulfate pentahydrate with tripodal ligands. |
Authors of publication | Zhao, Wei; Fan, Jian; Song, You; Kawaguchi, Hiroyuki; Okamura, Taka-aki; Sun, Wei-Yin; Ueyama, Norikazu |
Journal of publication | Dalton transactions (Cambridge, England : 2003) |
Year of publication | 2005 |
Journal issue | 8 |
Pages of publication | 1509 - 1517 |
a | 8.676 ± 0.0017 Å |
b | 9.911 ± 0.002 Å |
c | 9.999 ± 0.002 Å |
α | 82.3 ± 0.03° |
β | 81.31 ± 0.03° |
γ | 89.57 ± 0.03° |
Cell volume | 842.2 ± 0.3 Å3 |
Cell temperature | 293 ± 2 K |
Ambient diffraction temperature | 293 ± 2 K |
Number of distinct elements | 6 |
Space group number | 2 |
Hermann-Mauguin space group symbol | P -1 |
Hall space group symbol | -P 1 |
Residual factor for all reflections | 0.0602 |
Residual factor for significantly intense reflections | 0.0342 |
Weighted residual factors for significantly intense reflections | 0.0797 |
Weighted residual factors for all reflections included in the refinement | 0.1009 |
Goodness-of-fit parameter for all reflections included in the refinement | 1.119 |
Diffraction radiation wavelength | 0.71073 Å |
Diffraction radiation type | MoKα |